Target
Acetylcholinesterase
Ligand
BDBM31904
Substrate
Meas. Tech.
ChEMBL_446304 (CHEMBL895407)
IC50
32300±n/a nM
Citation
 Bolognesi, MLBanzi, RBartolini, MCavalli, ATarozzi, AAndrisano, VMinarini, ARosini, MTumiatti, VBergamini, CFato, RLenaz, GHrelia, PCattaneo, ARecanatini, MMelchiorre, C Novel class of quinone-bearing polyamines as multi-target-directed ligands to combat Alzheimer's disease. J Med Chem 50:4882-97 (2007)  
Target
Name:
Acetylcholinesterase
Synonyms:
ACES_HUMAN Acetylcholinesterase (AChE) | Acetylcholinesterase (human AChE)
Type:
Enzyme
Mol. Mass.:
67792.70
Organism:
Homo sapiens (Human)
Description:
P22303
Residue:
614
  
Inhibitor
Name:
BDBM31904
Synonyms:
CHEMBL345124 Propidium Iodide, 2 | propidium iodide
Type:
Small organic molecule
Emp. Form.:
C27H34N4
Mol. Mass.:
414.5846
SMILES:
CC[N+](C)(CC)CCCn1c(-c2ccccc2)c2cc(N)ccc2c2ccc(=[NH2+])cc12
: