Target
Growth hormone secretagogue receptor type 1
Ligand
BDBM50222864
Substrate
Meas. Tech.
ChEMBL_446527 (CHEMBL895698)
Ki
1200±n/a nM
Citation
 Rudolph, JEsler, WPO'connor, SCoish, PDWickens, PLBrands, MBierer, DEBloomquist, BTBondar, GChen, LChuang, CYClaus, THFathi, ZFu, WKhire, URKristie, JALiu, XGLowe, DBMcClure, ACMichels, MOrtiz, AARamsden, PDSchoenleber, RWShelekhin, TEVakalopoulos, ATang, WWang, LYi, LGardell, SJLivingston, JNSweet, LJBullock, WH Quinazolinone derivatives as orally available ghrelin receptor antagonists for the treatment of diabetes and obesity. J Med Chem 50:5202-16 (2007)  
Target
Name:
Growth hormone secretagogue receptor type 1
Synonyms:
Ghrelin receptor
Type:
PROTEIN
Mol. Mass.:
41494.35
Organism:
Ovis aries
Description:
ChEMBL_446527
Residue:
366
  
Inhibitor
Name:
BDBM50222864
Synonyms:
3-[(1-isopropylpiperidin-3-yl)methyl]-2-(2-methylphenyl)-quinazolin-4(3H)-one | CHEMBL242568
Type:
Small organic molecule
Emp. Form.:
C24H29N3O
Mol. Mass.:
375.5066
SMILES:
CC(C)N1CCCC(Cn2c(nc3ccccc3c2=O)-c2ccccc2C)C1
: