Target
Dehydrogenase/reductase SDR family member 9
Ligand
BDBM50371162
Substrate
Meas. Tech.
ChEMBL_447932 (CHEMBL898183)
IC50
209000±n/a nM
Citation
 Harrak, YRosell, GDaidone, GPlescia, SSchillaci, DPujol, MD Synthesis and biological activity of new anti-inflammatory compounds containing the 1,4-benzodioxine and/or pyrrole system. Bioorg Med Chem 15:4876-90 (2007)  
Target
Name:
Dehydrogenase/reductase SDR family member 9
Synonyms:
3-alpha hydroxysteroid dehydrogenase DHRS9_RAT Short-chain dehydrogenase/reductase retSDR8 | eRolDH
Type:
PROTEIN
Mol. Mass.:
35223.09
Organism:
Rattus norvegicus
Description:
ChEMBL_447932
Residue:
319
  
Inhibitor
Name:
BDBM50371162
Synonyms:
CHEMBL394393
Type:
Small organic molecule
Emp. Form.:
C12H14O4
Mol. Mass.:
222.2372
SMILES:
OC(=O)CCCc1ccc2OCCOc2c1
: