Target
Tyrosine-protein phosphatase non-receptor type 1
Ligand
BDBM50214531
Substrate
Meas. Tech.
ChEMBL_448045 (CHEMBL898300)
IC50
18000±n/a nM
Citation
 Maccari, RPaoli, POttanà, RJacomelli, MCiurleo, RManao, GSteindl, TLanger, TVigorita, MGCamici, G 5-Arylidene-2,4-thiazolidinediones as inhibitors of protein tyrosine phosphatases. Bioorg Med Chem 15:5137-49 (2007)  
Target
Name:
Tyrosine-protein phosphatase non-receptor type 1
Synonyms:
PTN1_HUMAN PTPN1 Protein tyrosine phosphatase-1B (PTP1B) Protein-tyrosine phosphatase 1B (PTP1B) Tyrosine-protein phosphatase non-receptor type 1 (PTP1B)
Type:
Protein phosphatase
Mol. Mass.:
49963.76
Organism:
Homo sapiens (Human)
Description:
Human recombinant GST-fusion PTP1B (1-435).
Residue:
435
  
Inhibitor
Name:
BDBM50214531
Synonyms:
4-[2,4-dioxo-5-(3-phenoxybenzylidene)thiazolidin-3-yl]methylbenzoic acid | CHEMBL235372
Type:
Small organic molecule
Emp. Form.:
C24H17NO5S
Mol. Mass.:
431.46
SMILES:
OC(=O)c1ccc(CN2C(=O)S\C(=C/c3cccc(Oc4ccccc4)c3)C2=O)cc1
: