Target
Low molecular weight phosphotyrosine protein phosphatase
Ligand
BDBM50214534
Substrate
Meas. Tech.
ChEMBL_448048 (CHEMBL898303)
IC50
>450000±n/a nM
Citation
 Maccari, RPaoli, POttanà, RJacomelli, MCiurleo, RManao, GSteindl, TLanger, TVigorita, MGCamici, G 5-Arylidene-2,4-thiazolidinediones as inhibitors of protein tyrosine phosphatases. Bioorg Med Chem 15:5137-49 (2007)  
Target
Name:
Low molecular weight phosphotyrosine protein phosphatase
Synonyms:
LTP1 | PPAL_YEAST
Type:
PROTEIN
Mol. Mass.:
18678.01
Organism:
Saccharomyces cerevisiae
Description:
ChEMBL_563764
Residue:
161
  
Inhibitor
Name:
BDBM50214534
Synonyms:
4-[5-(4-carboxymethoxybenzylidene)-2,4-dioxothiazolidin-3-yl]methylbenzoic acid | CHEMBL392380
Type:
Small organic molecule
Emp. Form.:
C20H15NO7S
Mol. Mass.:
413.401
SMILES:
OC(=O)COc1ccc(\C=C2/SC(=O)N(Cc3ccc(cc3)C(O)=O)C2=O)cc1
: