Target
Tyrosine-protein phosphatase non-receptor type 2
Ligand
BDBM50220217
Substrate
Meas. Tech.
ChEMBL_449135 (CHEMBL899400)
Ki
8200±n/a nM
Citation
 Bhattarai, BRShrestha, SHam, SWKim, KRCheon, HGLee, KHCho, H 2-O-carboxymethylpyrogallol derivatives as PTP1B inhibitors with antihyperglycemic activity. Bioorg Med Chem Lett 17:5357-60 (2007)  
Target
Name:
Tyrosine-protein phosphatase non-receptor type 2
Synonyms:
PTN2_HUMAN PTPT T-cell protein-tyrosine phosphatase TCPTP Tyrosine-protein phosphatase non-receptor type 2 (TC-PTP)
Type:
Protein
Mol. Mass.:
48481.80
Organism:
Homo sapiens (Human)
Description:
P17706
Residue:
415
  
Inhibitor
Name:
BDBM50220217
Synonyms:
CHEMBL238138 | [3-hydroxy-3',5'-bis-trifluoromethyl-5-(4-trifluoromethyl-benzyloxy)-biphenyl-4-yloxy]-acetic acid
Type:
Small organic molecule
Emp. Form.:
C24H15F9O5
Mol. Mass.:
554.3585
SMILES:
OC(=O)COc1c(O)cc(cc1OCc1ccc(cc1)C(F)(F)F)-c1cc(cc(c1)C(F)(F)F)C(F)(F)F
: