Target
Dipeptidyl peptidase 8
Ligand
BDBM50221073
Substrate
Meas. Tech.
ChEMBL_449467 (CHEMBL899733)
IC50
3200±n/a nM
Citation
 Wright, SWAmmirati, MJAndrews, KMBrodeur, AMDanley, DEDoran, SDLillquist, JSLiu, SMcClure, LDMcPherson, RKOlson, TVOrena, SJParker, JCRocke, BNSoeller, WCSoglia, CBTreadway, JLVanvolkenburg, MAZhao, ZCox, ED (3R,4S)-4-(2,4,5-Trifluorophenyl)-pyrrolidin-3-ylamine inhibitors of dipeptidyl peptidase IV: synthesis, in vitro, in vivo, and X-ray crystallographic characterization. Bioorg Med Chem Lett 17:5638-42 (2007)  
Target
Name:
Dipeptidyl peptidase 8
Synonyms:
DPP8 DPRP-1 Dipeptidyl peptidase 8 (DPP-8) Dipeptidyl peptidase 8/9 Dipeptidyl peptidase VIII Prolyl dipeptidase DPP8
Type:
Enzyme
Mol. Mass.:
103342.62
Organism:
Homo sapiens (Human)
Description:
Q6V1X1
Residue:
898
  
Inhibitor
Name:
BDBM50221073
Synonyms:
(3R,4S)-1-(6-(6-methoxypyridin-3-yl)pyrimidin-4-yl)-4-(2,4,5-trifluorophenyl)pyrrolidin-3-amine CHEMBL237786
Type:
Small organic molecule
Emp. Form.:
C20H18F3N5O
Mol. Mass.:
401.385
SMILES:
COc1ccc(cn1)-c1cc(ncn1)N1C[C@H](N)[C@H](C1)c1cc(F)c(F)cc1F
: