Target
Trans-2-enoyl-ACP reductase II
Ligand
BDBM50223360
Substrate
Meas. Tech.
ChEMBL_450119 (CHEMBL900394)
IC50
3.7±n/a nM
Citation
 Ozawa, TKitagawa, HYamamoto, YTakahata, SIida, MOsaki, YYamada, K Phenylimidazole derivatives as specific inhibitors of bacterial enoyl-acyl carrier protein reductase FabK. Bioorg Med Chem 15:7325-36 (2007)  
Target
Name:
Trans-2-enoyl-ACP reductase II
Synonyms:
Enoyl-ACP Reductase (FabK) NADH-dependent, FAD-containing enoyl-ACP | trans-2-enoyl-ACP reductase II
Type:
Enzyme
Mol. Mass.:
34170.89
Organism:
Streptococcus pneumoniae
Description:
Residue:
324
  
Inhibitor
Name:
BDBM50223360
Synonyms:
1-((5-(3,4-dichlorophenyl)-1H-imidazol-2-yl)methyl)-3-(5-(pyridin-2-ylthio)thiazol-2-yl)urea | CHEMBL392732
Type:
Small organic molecule
Emp. Form.:
C19H14Cl2N6OS2
Mol. Mass.:
477.39
SMILES:
Clc1ccc(cc1Cl)-c1c[nH]c(CNC(=O)Nc2ncc(Sc3ccccn3)s2)n1
: