Target
Beta-2 adrenergic receptor
Ligand
BDBM50223428
Substrate
Meas. Tech.
ChEMBL_450127 (CHEMBL900403)
EC50
0.020000±n/a nM
Citation
 Brown, ADBunnage, MEGlossop, PAHolbrook, MJones, RDLane, CALewthwaite, RAMantell, SPerros-Huguet, CPrice, DAWebster, R The discovery of indole-derived long acting beta2-adrenoceptor agonists for the treatment of asthma and COPD. Bioorg Med Chem Lett 17:6188-91 (2007)  
Target
Name:
Beta-2 adrenergic receptor
Synonyms:
ADRB2 ADRB2_HUMAN Beta-2 adrenoceptor | Beta-2 adrenoreceptor
Type:
Mol. Mass.:
46461.69
Organism:
Homo sapiens (Human)
Description:
P07550
Residue:
413
  
Inhibitor
Name:
BDBM50223428
Synonyms:
CHEMBL236039 | N-(2-methoxybenzyl)-5-((R)-2-((R)-2-hydroxy-2-(4-hydroxy-3-(hydroxymethyl)phenyl)ethylamino)propyl)-1H-indole-2-carboxamide
Type:
Small organic molecule
Emp. Form.:
C29H33N3O5
Mol. Mass.:
503.5894
SMILES:
COc1ccccc1CNC(=O)c1cc2cc(C[C@@H](C)NC[C@H](O)c3ccc(O)c(CO)c3)ccc2[nH]1
: