Target
Acetylcholinesterase
Ligand
BDBM50149891
Substrate
Meas. Tech.
ChEMBL_451097 (CHEMBL900177)
IC50
2110000±n/a nM
Citation
 Elsinghorst, PWCieslik, JSMohr, KTränkle, CGütschow, M First gallamine-tacrine hybrid: design and characterization at cholinesterases and the M2 muscarinic receptor. J Med Chem 50:5685-95 (2007)  
Target
Name:
Acetylcholinesterase
Synonyms:
ACES_HUMAN Acetylcholinesterase (AChE) | Acetylcholinesterase (human AChE)
Type:
Enzyme
Mol. Mass.:
67792.70
Organism:
Homo sapiens (Human)
Description:
P22303
Residue:
614
  
Inhibitor
Name:
BDBM50149891
Synonyms:
2,2',2''-[1,2,3-BENZENE-TRIYLTRIS(OXY)]TRIS[N,N,N-TRIETHYLETHANAMINIUM] GALLAMINE
Type:
Small organic molecule
Emp. Form.:
C30H60N3O3
Mol. Mass.:
510.8141
SMILES:
CC[N+](CC)(CC)CCOc1cccc(OCC[N+](CC)(CC)CC)c1OCC[N+](CC)(CC)CC
: