Target
Prothrombin
Ligand
BDBM50228412
Substrate
Meas. Tech.
ChEMBL_452529 (CHEMBL901753)
IC50
45000±n/a nM
Citation
 Joossens, JAli, OMEl-Sayed, ISurpateanu, GVan der Veken, PLambeir, AMSetyono-Han, BFoekens, JASchneider, ASchmalix, WHaemers, AAugustyns, K Small, potent, and selective diaryl phosphonate inhibitors for urokinase-type plasminogen activator with in vivo antimetastatic properties. J Med Chem 50:6638-46 (2007)  
Target
Name:
Prothrombin
Synonyms:
Activated blood-coagulation factor II Activation peptide fragment 2 Blood-coagulation factor IIa E thrombin Factor IIa Gamma-thrombin THRB_RAT Thrombin Thrombin light chain Thrombofort | Tropostasin
Type:
Protein
Mol. Mass.:
70413.05
Organism:
Rattus norvegicus
Description:
P18292
Residue:
617
  
Inhibitor
Name:
BDBM50228412
Synonyms:
CHEMBL393979 | methyl 1-(bis(4-acetamidophenoxy)phosphoryl)-2-(4guanidino-phenyl)ethylcarbamate
Type:
Small organic molecule
Emp. Form.:
C27H31N6O7P
Mol. Mass.:
582.5448
SMILES:
[#6]-[#8]-[#6](=O)-[#7]-[#6](-[#6]-c1ccc(cc1)\[#7]=[#6](\[#7])-[#7])P(=O)([#8]-c1ccc(-[#7]-[#6](-[#6])=O)cc1)[#8]-c1ccc(-[#7]-[#6](-[#6])=O)cc1
: