Target
Urokinase-type plasminogen activator
Ligand
BDBM50228412
Substrate
Meas. Tech.
ChEMBL_452526 (CHEMBL901750)
IC50
8±n/a nM
Citation
 Joossens, JAli, OMEl-Sayed, ISurpateanu, GVan der Veken, PLambeir, AMSetyono-Han, BFoekens, JASchneider, ASchmalix, WHaemers, AAugustyns, K Small, potent, and selective diaryl phosphonate inhibitors for urokinase-type plasminogen activator with in vivo antimetastatic properties. J Med Chem 50:6638-46 (2007)  
Target
Name:
Urokinase-type plasminogen activator
Synonyms:
Plau Urokinase-type plasminogen activator (uPA)
Type:
Enzyme
Mol. Mass.:
48282.52
Organism:
Mus musculus (Mouse)
Description:
P06869
Residue:
433
  
Inhibitor
Name:
BDBM50228412
Synonyms:
CHEMBL393979 | methyl 1-(bis(4-acetamidophenoxy)phosphoryl)-2-(4guanidino-phenyl)ethylcarbamate
Type:
Small organic molecule
Emp. Form.:
C27H31N6O7P
Mol. Mass.:
582.5448
SMILES:
[#6]-[#8]-[#6](=O)-[#7]-[#6](-[#6]-c1ccc(cc1)\[#7]=[#6](\[#7])-[#7])P(=O)([#8]-c1ccc(-[#7]-[#6](-[#6])=O)cc1)[#8]-c1ccc(-[#7]-[#6](-[#6])=O)cc1
: