Target
Tissue-type plasminogen activator
Ligand
BDBM50194743
Substrate
Meas. Tech.
ChEMBL_452507 (CHEMBL902746)
IC50
280±n/a nM
Citation
 Joossens, JAli, OMEl-Sayed, ISurpateanu, GVan der Veken, PLambeir, AMSetyono-Han, BFoekens, JASchneider, ASchmalix, WHaemers, AAugustyns, K Small, potent, and selective diaryl phosphonate inhibitors for urokinase-type plasminogen activator with in vivo antimetastatic properties. J Med Chem 50:6638-46 (2007)  
Target
Name:
Tissue-type plasminogen activator
Synonyms:
Alteplase Reteplase Thrombin receptor protein Tissue-type plasminogen activator (tPA) t-PA t-plasminogen activator
Type:
Enzyme
Mol. Mass.:
62931.08
Organism:
Homo sapiens (Human)
Description:
Residue:
562
  
Inhibitor
Name:
BDBM50194743
Synonyms:
CHEMBL214814 {2-(4-guanidino-phenyl)-1-[(S)-2-((R)-3-hydroxy-2-phenylmethanesulfonylamino-propionylamino)-propionylamino]-ethyl}-phosphonic acid diphenyl ester
Type:
Small organic molecule
Emp. Form.:
C34H39N6O8PS
Mol. Mass.:
722.748
SMILES:
[#6]-[#6@H](-[#7]-[#6](=O)-[#6@@H](-[#6]-[#8])-[#7]S(=O)(=O)[#6]-c1ccccc1)-[#6](=O)-[#7]-[#6](-[#6]-c1ccc(cc1)\[#7]=[#6](\[#7])-[#7])P(=O)([#8]-c1ccccc1)[#8]-c1ccccc1
: