Target
Urokinase-type plasminogen activator
Ligand
BDBM50228410
Substrate
Meas. Tech.
ChEMBL_452505 (CHEMBL902744)
IC50
7±n/a nM
Citation
 Joossens, JAli, OMEl-Sayed, ISurpateanu, GVan der Veken, PLambeir, AMSetyono-Han, BFoekens, JASchneider, ASchmalix, WHaemers, AAugustyns, K Small, potent, and selective diaryl phosphonate inhibitors for urokinase-type plasminogen activator with in vivo antimetastatic properties. J Med Chem 50:6638-46 (2007)  
Target
Name:
Urokinase-type plasminogen activator
Synonyms:
PLAU UROK_HUMAN Urokinase-type plasminogen activator (uPA) | Urokinase-type plasminogen activator/surface receptor
Type:
Enzyme
Mol. Mass.:
48528.62
Organism:
Homo sapiens (Human)
Description:
P00749
Residue:
431
  
Inhibitor
Name:
BDBM50228410
Synonyms:
CHEMBL239535 | diphenyl 1-(benzyloxycarbonylamino)-2-(4-guanidinophenyl)-ethanephosphonate
Type:
Small organic molecule
Emp. Form.:
C29H29N4O5P
Mol. Mass.:
544.5381
SMILES:
[#7]\[#6](-[#7])=[#7]\c1ccc(-[#6]-[#6](-[#7]-[#6](=O)-[#8]-[#6]-c2ccccc2)P(=O)([#8]-c2ccccc2)[#8]-c2ccccc2)cc1
: