Target
Thymidine kinase 2, mitochondrial
Ligand
BDBM50206488
Substrate
Meas. Tech.
ChEMBL_454745 (CHEMBL886767)
IC50
6300±n/a nM
Citation
 Ciliberti, NManfredini, SAngusti, ADurini, ESolaroli, NVertuani, SBuzzoni, LBonache, MCBen-Shalom, EKarlsson, ASaada, ABalzarini, J Novel selective human mitochondrial kinase inhibitors: design, synthesis and enzymatic activity. Bioorg Med Chem 15:3065-81 (2007)  
Target
Name:
Thymidine kinase 2, mitochondrial
Synonyms:
KITM_HUMAN Thymidine kinase, mitochondrial
Type:
PROTEIN
Mol. Mass.:
31013.50
Organism:
Homo sapiens (Human)
Description:
ChEMBL_1333885
Residue:
265
  
Inhibitor
Name:
BDBM50206488
Synonyms:
(2R,3S,4R,5R)-2-(5-(2-bromovinyl)-2,4-dioxo-3,4-dihydropyrimidin-1(2H)-yl)-4-hydroxy-5-(hydroxymethyl)tetrahydrofuran-3-yl octanoate CHEMBL238635
Type:
Small organic molecule
Emp. Form.:
C19H27BrN2O7
Mol. Mass.:
475.331
SMILES:
CCCCCCCC(=O)O[C@H]1[C@H](O)[C@@H](CO)O[C@H]1n1cc(C=CBr)c(=O)[nH]c1=O
: