Target
DNA polymerase catalytic subunit
Ligand
BDBM50210620
Substrate
Meas. Tech.
ChEMBL_455453 (CHEMBL886229)
IC50
77±n/a nM
Citation
 Schnute, MEAnderson, DJBrideau, RJCiske, FLCollier, SACudahy, MMEggen, MGenin, MJHopkins, TAJudge, TMKim, EJKnechtel, MLNair, SKNieman, JAOien, NLScott, ATanis, SPVaillancourt, VAWathen, MWWieber, JL 2-Aryl-2-hydroxyethylamine substituted 4-oxo-4,7-dihydrothieno[2,3-b]pyridines as broad-spectrum inhibitors of human herpesvirus polymerases. Bioorg Med Chem Lett 17:3349-53 (2007)  
Target
Name:
DNA polymerase catalytic subunit
Synonyms:
DNA polymerase HFLF2 UL54
Type:
Protein
Mol. Mass.:
137111.39
Organism:
Human cytomegalovirus (HCMV strain AD169)
Description:
P08546
Residue:
1242
  
Inhibitor
Name:
BDBM50210620
Synonyms:
CHEMBL247148 | N-(4-chlorobenzyl)-2-(((2-(furan-2-yl)-2-hydroxyethyl)(methyl)amino)methyl)-7-methyl-4-oxo-4,7-dihydrothieno[2,3-b]pyridine-5-carboxamide
Type:
Small organic molecule
Emp. Form.:
C24H24ClN3O4S
Mol. Mass.:
485.983
SMILES:
CN(CC(O)c1ccco1)Cc1cc2c(s1)n(C)cc(C(=O)NCc1ccc(Cl)cc1)c2=O
: