Target
Muscarinic acetylcholine receptor M2
Ligand
BDBM50218043
Substrate
Meas. Tech.
ChEMBL_457003 (CHEMBL923346)
Ki
335.3±n/a nM
Citation
 Kumar, NKaur, KAeron, SDharmarajan, SSilamkoti, ADMehta, AGupta, SChugh, AGupta, JBSalman, MPalle, VPCliffe, IA Synthesis and optimization of novel and selective muscarinic M(3) receptor antagonists. Bioorg Med Chem Lett 17:5256-60 (2007)  
Target
Name:
Muscarinic acetylcholine receptor M2
Synonyms:
ACM2_RAT Chrm-2 | Chrm2
Type:
Enzyme Catalytic Domain
Mol. Mass.:
51555.53
Organism:
RAT
Description:
P10980
Residue:
466
  
Inhibitor
Name:
BDBM50218043
Synonyms:
(R)-2-cyclopentyl-2-hydroxy-N-((1S,5R,6s)-3-phenethyl-3-aza-bicyclo[3.1.0]hexan-6-yl)-2-phenylacetamide | CHEMBL249830
Type:
Small organic molecule
Emp. Form.:
C26H32N2O2
Mol. Mass.:
404.5445
SMILES:
OC(C1CCCC1)(C(=O)N[C@@H]1[C@H]2CN(CCc3ccccc3)C[C@@H]12)c1ccccc1
: