Target
Muscarinic acetylcholine receptor M2
Ligand
BDBM50218048
Substrate
Meas. Tech.
ChEMBL_457003 (CHEMBL923346)
Ki
1139±n/a nM
Citation
 Kumar, NKaur, KAeron, SDharmarajan, SSilamkoti, ADMehta, AGupta, SChugh, AGupta, JBSalman, MPalle, VPCliffe, IA Synthesis and optimization of novel and selective muscarinic M(3) receptor antagonists. Bioorg Med Chem Lett 17:5256-60 (2007)  
Target
Name:
Muscarinic acetylcholine receptor M2
Synonyms:
ACM2_RAT Chrm-2 | Chrm2
Type:
Enzyme Catalytic Domain
Mol. Mass.:
51555.53
Organism:
RAT
Description:
P10980
Residue:
466
  
Inhibitor
Name:
BDBM50218048
Synonyms:
(S)-2-cyclopentyl-2-hydroxy-N-((1S,5R,6s)-3-(4-methylpent-3-enyl)-3-aza-bicyclo[3.1.0]hexan-6-yl)-2-phenylacetamide | CHEMBL250031
Type:
Small organic molecule
Emp. Form.:
C24H34N2O2
Mol. Mass.:
382.539
SMILES:
[#6]\[#6](-[#6])=[#6]\[#6]-[#6]-[#7]-1-[#6]-[#6@H]-2-[#6@@H](-[#6]-1)-[#6@@H]-2-[#7]-[#6](=O)[C@]([#8])([#6]-1-[#6]-[#6]-[#6]-[#6]-1)c1ccccc1
: