Target
Serine/threonine-protein kinase Chk1
Ligand
BDBM50221586
Substrate
Meas. Tech.
ChEMBL_457662 (CHEMBL923939)
IC50
47±n/a nM
Citation
 Tao, ZFLi, GTong, YStewart, KDChen, ZBui, MHMerta, PPark, CKovar, PZhang, HSham, HLRosenberg, SHSowin, TJLin, NH Discovery of 4'-(1,4-dihydro-indeno[1,2-c]pyrazol-3-yl)-benzonitriles and 4'-(1,4-dihydro-indeno[1,2-c]pyrazol-3-yl)-pyridine-2'-carbonitriles as potent checkpoint kinase 1 (Chk1) inhibitors. Bioorg Med Chem Lett 17:5944-51 (2007)  
Target
Name:
Serine/threonine-protein kinase Chk1
Synonyms:
CHEK1 CHK1 checkpoint homolog Checkpoint kinase-1 (CHK1)
Type:
Enzyme Catalytic Domain
Mol. Mass.:
54443.02
Organism:
Homo sapiens (Human)
Description:
gi_166295192
Residue:
476
  
Inhibitor
Name:
BDBM50221586
Synonyms:
6,7-dimethoxy-3-[4-(1H-pyrazol-4-yl)-phenyl]-2,4-dihydro-indeno[1,2-c]pyrazole | CHEMBL398913
Type:
Small organic molecule
Emp. Form.:
C21H18N4O2
Mol. Mass.:
358.3932
SMILES:
COc1cc2Cc3c(n[nH]c3-c2cc1OC)-c1ccc(cc1)-c1cn[nH]c1
: