Target
Cannabinoid receptor 2
Ligand
BDBM50222832
Substrate
Meas. Tech.
ChEMBL_458048 (CHEMBL925386)
IC50
2.1±n/a nM
Citation
 Ohta, HIshizaka, TTatsuzuki, MYoshinaga, MIida, ITomishima, YToda, YSaito, S N-Alkylidenearylcarboxamides as new potent and selective CB(2) cannabinoid receptor agonists with good oral bioavailability. Bioorg Med Chem Lett 17:6299-304 (2007)  
Target
Name:
Cannabinoid receptor 2
Synonyms:
CANNABINOID CB2 CB2 CB2B CNR2_HUMAN Cannabinoid CB2 receptor Cannabinoid receptor 2 (CB2R) | hCB2
Type:
G Protein-Coupled Receptor (GPCR)
Mol. Mass.:
39690.94
Organism:
Homo sapiens (Human)
Description:
P34972
Residue:
360
  
Inhibitor
Name:
BDBM50222832
Synonyms:
CHEMBL248386 | N-(5-tert-butyl-3-(cyclopropylmethyl)-4-methylthiazol-2(3H)-ylidene)-2-methyl-5-(trifluoromethyl)benzamide
Type:
Small organic molecule
Emp. Form.:
C21H25F3N2OS
Mol. Mass.:
410.496
SMILES:
Cc1c(sc(=NC(=O)c2cc(ccc2C)C(F)(F)F)n1CC1CC1)C(C)(C)C
: