Target
Prostaglandin E2 receptor EP4 subtype
Ligand
BDBM50224570
Substrate
Meas. Tech.
ChEMBL_458318 (CHEMBL925649)
Ki
26±n/a nM
Citation
 Zhao, ZAraldi, GLXiao, YReddy, APLiao, YKarra, SBrugger, NFischer, DPalmer, E Synthesis and evaluation of novel pyrazolidinone analogs of PGE2 as EP2 and EP4 receptors agonists. Bioorg Med Chem Lett 17:6572-5 (2007)  
Target
Name:
Prostaglandin E2 receptor EP4 subtype
Synonyms:
PE2R4_HUMAN PGE2 receptor EP4 subtype PTGER4 Prostanoid EP4 receptor
Type:
Enzyme
Mol. Mass.:
53134.53
Organism:
Homo sapiens (Human)
Description:
P35408
Residue:
488
  
Inhibitor
Name:
BDBM50224570
Synonyms:
(S)-4-(2-(2-(3-hydroxy-4-(3-iodophenyl)butyl)-5-oxopyrazolidin-1-yl)ethyl)benzoic acid | CHEMBL398827
Type:
Small organic molecule
Emp. Form.:
C22H25IN2O4
Mol. Mass.:
508.3494
SMILES:
O[C@H](CCN1CCC(=O)N1CCc1ccc(cc1)C(O)=O)Cc1cccc(I)c1
: