Target
Prostaglandin E2 receptor EP2 subtype
Ligand
BDBM50224571
Substrate
Meas. Tech.
ChEMBL_458316 (CHEMBL925647)
Ki
2200±n/a nM
Citation
 Zhao, ZAraldi, GLXiao, YReddy, APLiao, YKarra, SBrugger, NFischer, DPalmer, E Synthesis and evaluation of novel pyrazolidinone analogs of PGE2 as EP2 and EP4 receptors agonists. Bioorg Med Chem Lett 17:6572-5 (2007)  
Target
Name:
Prostaglandin E2 receptor EP2 subtype
Synonyms:
PE2R2_HUMAN PTGER2 Prostaglandin E2 receptor Prostanoid EP2 Receptor
Type:
Enzyme
Mol. Mass.:
39775.71
Organism:
Homo sapiens (Human)
Description:
P43116
Residue:
358
  
Inhibitor
Name:
BDBM50224571
Synonyms:
4-(2-(2-(3-hydroxyoctyl)-5-oxopyrazolidin-1-yl)ethyl)benzoic acid | CHEMBL249136
Type:
Small organic molecule
Emp. Form.:
C20H30N2O4
Mol. Mass.:
362.4632
SMILES:
CCCCCC(O)CCN1CCC(=O)N1CCc1ccc(cc1)C(O)=O
: