Target
Prostaglandin E2 receptor EP4 subtype
Ligand
BDBM50224575
Substrate
Meas. Tech.
ChEMBL_458319 (CHEMBL925650)
EC50
0.1±n/a nM
Citation
 Zhao, ZAraldi, GLXiao, YReddy, APLiao, YKarra, SBrugger, NFischer, DPalmer, E Synthesis and evaluation of novel pyrazolidinone analogs of PGE2 as EP2 and EP4 receptors agonists. Bioorg Med Chem Lett 17:6572-5 (2007)  
Target
Name:
Prostaglandin E2 receptor EP4 subtype
Synonyms:
PE2R4_HUMAN PGE2 receptor EP4 subtype PTGER4 Prostanoid EP4 receptor
Type:
Enzyme
Mol. Mass.:
53134.53
Organism:
Homo sapiens (Human)
Description:
P35408
Residue:
488
  
Inhibitor
Name:
BDBM50224575
Synonyms:
(S)-4-(2-(2-(4-(3-bromophenyl)-3-hydroxybutyl)-5-oxopyrazolidin-1-yl)ethyl)benzoic acid | CHEMBL249953
Type:
Small organic molecule
Emp. Form.:
C22H25BrN2O4
Mol. Mass.:
461.349
SMILES:
O[C@H](CCN1CCC(=O)N1CCc1ccc(cc1)C(O)=O)Cc1cccc(Br)c1
: