Target
Cruzipain
Ligand
BDBM50229129
Substrate
Meas. Tech.
ChEMBL_458776 (CHEMBL942076)
IC50
5±n/a nM
Citation
 González, FVIzquierdo, JRodríguez, SMcKerrow, JHHansell, E Dipeptidyl-alpha,beta-epoxyesters as potent irreversible inhibitors of the cysteine proteases cruzain and rhodesain. Bioorg Med Chem Lett 17:6697-700 (2007)  
Target
Name:
Cruzipain
Synonyms:
CYSP_TRYCR Cruzaine | Major cysteine proteinase
Type:
Protein
Mol. Mass.:
49831.41
Organism:
Trypanosoma cruzi
Description:
P25779
Residue:
467
  
Inhibitor
Name:
BDBM50229129
Synonyms:
4-Methyl-piperazine-1-carboxylic acid [(S)-1-((E)-(S)-3-benzenesulfonyl-1-phenethyl-allylcarbamoyl)-2-phenyl-ethyl]-amide 4-methyl-N-((S)-1-oxo-3-phenyl-1-((S)-5-phenyl-1-(phenylsulfonyl)pent-1-en-3-ylamino)propan-2-yl)piperazine-1-carboxamide CHEMBL91704 | K-777
Type:
Small organic molecule
Emp. Form.:
C32H38N4O4S
Mol. Mass.:
574.734
SMILES:
CN1CCN(CC1)C(=O)N[C@@H](Cc1ccccc1)C(=O)N[C@@H](CCc1ccccc1)C=CS(=O)(=O)c1ccccc1
: