Target
Kinesin-like protein KIF11
Ligand
BDBM50198305
Substrate
Meas. Tech.
ChEMBL_458813 (CHEMBL942113)
IC50
22000±n/a nM
Citation
 Liu, FYou, QDChen, YD Pharmacophore identification of KSP inhibitors. Bioorg Med Chem Lett 17:722-6 (2007)  
Target
Name:
Kinesin-like protein KIF11
Synonyms:
EG5 KIF11_HUMAN Kinesin Spindle Protein Eg5 TRIP5 | kinesin spindle protein
Type:
PROTEIN
Mol. Mass.:
119138.97
Organism:
Homo sapiens (Human)
Description:
ChEMBL_1457426
Residue:
1056
  
Inhibitor
Name:
BDBM50198305
Synonyms:
1,2,3,4,5,6,7,8,13,13,14,14-dodecachloro-1,4,4a,4b,5,8,8a,12b-octahydro-11-sulfo-1,4:5,8-dimethanotriphenylene-10-carboxylic acid CHEMBL401844 | NSC-270718
Type:
Small organic molecule
Emp. Form.:
C21H8Cl12O5S
Mol. Mass.:
797.786
SMILES:
OC(=O)c1cc2C3C(C4C(c2cc1S(O)(=O)=O)C1(Cl)C(Cl)=C(Cl)C4(Cl)C1(Cl)Cl)C1(Cl)C(Cl)=C(Cl)C3(Cl)C1(Cl)Cl
: