Target
Kinesin-like protein KIF11
Ligand
BDBM50198309
Substrate
Meas. Tech.
ChEMBL_458813 (CHEMBL942113)
IC50
10000±n/a nM
Citation
 Liu, FYou, QDChen, YD Pharmacophore identification of KSP inhibitors. Bioorg Med Chem Lett 17:722-6 (2007)  
Target
Name:
Kinesin-like protein KIF11
Synonyms:
EG5 KIF11_HUMAN Kinesin Spindle Protein Eg5 TRIP5 | kinesin spindle protein
Type:
PROTEIN
Mol. Mass.:
119138.97
Organism:
Homo sapiens (Human)
Description:
ChEMBL_1457426
Residue:
1056
  
Inhibitor
Name:
BDBM50198309
Synonyms:
(S)-4-(3-Hydroxy-phenyl)-6-methyl-2-thioxo-1,2,3,4-tetrahydro-pyrimidine-5-carboxylic acid ethyl ester CHEMBL254432 Monastrol
Type:
Small organic molecule
Emp. Form.:
C14H16N2O3S
Mol. Mass.:
292.353
SMILES:
CCOC(=O)C1[C@@H](NC(=S)N=C1C)c1cccc(O)c1
: