Target
Pancreatic triacylglycerol lipase
Ligand
BDBM50213683
Substrate
Meas. Tech.
ChEMBL_459067 (CHEMBL925170)
IC50
13000±n/a nM
Citation
 Jain, KSKathiravan, MKSomani, RSShishoo, CJ The biology and chemistry of hyperlipidemia. Bioorg Med Chem 15:4674-99 (2007)  
Target
Name:
Pancreatic triacylglycerol lipase
Synonyms:
LIPP_HUMAN PNLIP | Pancreatic lipase
Type:
PROTEIN
Mol. Mass.:
51157.75
Organism:
Homo sapiens (Human)
Description:
ChEMBL_527250
Residue:
465
  
Inhibitor
Name:
BDBM50213683
Synonyms:
CHEMBL218693 | carnosol
Type:
Small organic molecule
Emp. Form.:
C20H26O4
Mol. Mass.:
330.418
SMILES:
CC(C)c1cc2[C@@H]3C[C@H]4C(C)(C)CCC[C@]4(C(=O)O3)c2c(O)c1O
: