Target
Matrix metalloproteinase-9
Ligand
BDBM50227539
Substrate
Meas. Tech.
ChEMBL_459970 (CHEMBL943098)
IC50
137000±n/a nM
Citation
 Hayashi, RJin, XCook, GR Synthesis and evaluation of novel heterocyclic MMP inhibitors. Bioorg Med Chem Lett 17:6864-70 (2008)  
Target
Name:
Matrix metalloproteinase-9
Synonyms:
67 kDa matrix metalloproteinase-9 92 kDa gelatinase CLG4B Gelatinase B MMP9 Matrix metalloproteinase 9 (MMP-9) Matrix metalloproteinase-9 (MMP9)
Type:
Enzyme
Mol. Mass.:
78452.28
Organism:
Homo sapiens (Human)
Description:
P14780
Residue:
707
  
Inhibitor
Name:
BDBM50227539
Synonyms:
CHEMBL252327 | cyclobutyl 6-mercaptopicolinate
Type:
Small organic molecule
Emp. Form.:
C10H11NO2S
Mol. Mass.:
209.265
SMILES:
O=C(OC1CCC1)c1cccc(=S)[nH]1
: