Target
Matrix metalloproteinase-9
Ligand
BDBM50227565
Substrate
Meas. Tech.
ChEMBL_459970 (CHEMBL943098)
IC50
69000±n/a nM
Citation
 Hayashi, RJin, XCook, GR Synthesis and evaluation of novel heterocyclic MMP inhibitors. Bioorg Med Chem Lett 17:6864-70 (2008)  
Target
Name:
Matrix metalloproteinase-9
Synonyms:
67 kDa matrix metalloproteinase-9 92 kDa gelatinase CLG4B Gelatinase B MMP9 Matrix metalloproteinase 9 (MMP-9) Matrix metalloproteinase-9 (MMP9)
Type:
Enzyme
Mol. Mass.:
78452.28
Organism:
Homo sapiens (Human)
Description:
P14780
Residue:
707
  
Inhibitor
Name:
BDBM50227565
Synonyms:
3-methylbut-2-enyl 6-oxo-1,6-dihydropyridine-2-carboxylate | CHEMBL254627
Type:
Small organic molecule
Emp. Form.:
C11H13NO3
Mol. Mass.:
207.2258
SMILES:
CC(C)=CCOC(=O)c1cccc(=O)[nH]1
: