Target
Interstitial collagenase
Ligand
BDBM50227603
Substrate
Meas. Tech.
ChEMBL_459968 (CHEMBL943096)
IC50
31000±n/a nM
Citation
 Hayashi, RJin, XCook, GR Synthesis and evaluation of novel heterocyclic MMP inhibitors. Bioorg Med Chem Lett 17:6864-70 (2008)  
Target
Name:
Interstitial collagenase
Synonyms:
CLG MMP1 Matrix metalloproteinase-1 | Matrix metalloproteinase-1 (MMP-1)
Type:
Enzyme
Mol. Mass.:
54010.26
Organism:
Homo sapiens (Human)
Description:
P03956
Residue:
469
  
Inhibitor
Name:
BDBM50227603
Synonyms:
CHEMBL445939 | isopropyl 6-oxo-1,6-dihydropyridine-2-carboxylate
Type:
Small organic molecule
Emp. Form.:
C9H11NO3
Mol. Mass.:
181.1885
SMILES:
CC(C)OC(=O)c1cccc(=O)[nH]1
: