Target
Xaa-Pro dipeptidase
Ligand
BDBM11162
Substrate
Meas. Tech.
ChEMBL_461055 (CHEMBL944087)
IC50
>10000±n/a nM
Citation
 Kim, DKowalchick, JEBrockunier, LLParmee, EREiermann, GJFisher, MHHe, HLeiting, BLyons, KScapin, GPatel, SBPetrov, APryor, KDRoy, RSWu, JKZhang, XWyvratt, MJZhang, BBZhu, LThornberry, NAWeber, AE Discovery of potent and selective dipeptidyl peptidase IV inhibitors derived from beta-aminoamides bearing subsituted triazolopiperazines. J Med Chem 51:589-602 (2008)  
Target
Name:
Xaa-Pro dipeptidase
Synonyms:
PEPD PRD
Type:
PROTEIN
Mol. Mass.:
54541.05
Organism:
Homo sapiens (Human)
Description:
ChEMBL_159887
Residue:
493
  
Inhibitor
Name:
BDBM11162
Synonyms:
(1R)-3-oxo-3-[3-(trifluoroethyl)-5,6-dihydro[1,2,4]triazolo[4,3-a]pyrazin-7(8H)-yl]-1-(2,4,5-trifluorobenzyl)propylamine CHEMBL393336 Sitagliptin Triazolopiperazine Analogue 1 | US10479798, Compound MK0431
Type:
Small organic molecule
Emp. Form.:
C16H15F6N5O
Mol. Mass.:
407.3136
SMILES:
N[C@@H](CC(=O)N1CCn2c(C1)nnc2C(F)(F)F)Cc1cc(F)c(F)cc1F
: