Target
Xaa-Pro aminopeptidase 1
Ligand
BDBM50371255
Substrate
Meas. Tech.
ChEMBL_461054 (CHEMBL944086)
IC50
>10000±n/a nM
Citation
 Kim, DKowalchick, JEBrockunier, LLParmee, EREiermann, GJFisher, MHHe, HLeiting, BLyons, KScapin, GPatel, SBPetrov, APryor, KDRoy, RSWu, JKZhang, XWyvratt, MJZhang, BBZhu, LThornberry, NAWeber, AE Discovery of potent and selective dipeptidyl peptidase IV inhibitors derived from beta-aminoamides bearing subsituted triazolopiperazines. J Med Chem 51:589-602 (2008)  
Target
Name:
Xaa-Pro aminopeptidase 1
Synonyms:
Aminoacylproline aminopeptidase Soluble aminopeptidase P X-prolyl aminopeptidase 1, soluble XPNPEPL XPP1_HUMAN | sAmp
Type:
PROTEIN
Mol. Mass.:
69905.93
Organism:
Homo sapiens (Human)
Description:
ChEMBL_461054
Residue:
623
  
Inhibitor
Name:
BDBM50371255
Synonyms:
CHEMBL1203953
Type:
Small organic molecule
Emp. Form.:
C23H20F7N5O
Mol. Mass.:
515.4266
SMILES:
N[C@@H](CC(=O)N1CCn2c(nnc2C(F)(F)F)[C@H]1Cc1ccc(F)cc1)Cc1cc(F)c(F)cc1F
: