Target
D(2) dopamine receptor
Ligand
BDBM52987
Substrate
Meas. Tech.
ChEMBL_461138 (CHEMBL944161)
Ki
0.053±n/a nM
Citation
 Zhang, AZhang, YBranfman, ARBaldessarini, RJNeumeyer, JL Advances in development of dopaminergic aporphinoids. J Med Chem 50:171-81 (2007)  
Target
Name:
D(2) dopamine receptor
Synonyms:
DOPAMINE D2 DOPAMINE D2 Short Dopamine D2 receptor Drd2
Type:
G Protein-Coupled Receptor (GPCR)
Mol. Mass.:
50931.60
Organism:
Rattus norvegicus (rat)
Description:
P61169
Residue:
444
  
Inhibitor
Name:
BDBM52987
Synonyms:
(6aR)-6-propyl-5,6,6a,7-tetrahydro-4H-dibenzo[de,g]quinoline-2,10,11-triol;hydrate;hydrobromide CHEMBL288096 R( )-2,10,11-Trihydroxy-N-propyl-noraporphine hydrobromide hydrate cid_23640911
Type:
Small organic molecule
Emp. Form.:
C19H21NO3
Mol. Mass.:
311.3749
SMILES:
CCCN1CCc2cc(O)cc-3c2[C@H]1Cc1ccc(O)c(O)c-31
: