Target
Metabotropic glutamate receptor 1
Ligand
BDBM50177053
Substrate
Meas. Tech.
ChEMBL_461175 (CHEMBL945120)
IC50
3±n/a nM
Citation
 Schkeryantz, JMKingston, AEJohnson, MP Prospects for metabotropic glutamate 1 receptor antagonists in the treatment of neuropathic pain. J Med Chem 50:2563-8 (2007)  
Target
Name:
Metabotropic glutamate receptor 1
Synonyms:
GPRC1A GRM1_HUMAN Metabotropic Glutamate 1a | metabotropic glutamate 1
Type:
Enzyme
Mol. Mass.:
132358.19
Organism:
Homo sapiens (Human)
Description:
Q13255
Residue:
1194
  
Inhibitor
Name:
BDBM50177053
Synonyms:
9-Dimethylamino-3-(4-ethyl-phenyl)-3H-pyrido[3',2':4,5]thieno[3,2-d]pyrimidin-4-one CHEMBL385336
Type:
Small organic molecule
Emp. Form.:
C19H18N4OS
Mol. Mass.:
350.437
SMILES:
CCc1ccc(cc1)-n1cnc2c(sc3nccc(N(C)C)c23)c1=O
: