Target
Adenosine receptor A1
Ligand
BDBM50224771
Substrate
Meas. Tech.
ChEMBL_461282 (CHEMBL927300)
Ki
2053±n/a nM
Citation
 Cappellacci, LFranchetti, PVita, PPetrelli, RLavecchia, ACosta, BSpinetti, FMartini, CKlotz, KNGrifantini, M 5'-Carbamoyl derivatives of 2'-C-methyl-purine nucleosides as selective A1 adenosine receptor agonists: affinity, efficacy, and selectivity for A1 receptor from different species. Bioorg Med Chem 16:336-53 (2008)  
Target
Name:
Adenosine receptor A1
Synonyms:
A1 adenosine receptor ADENOSINE A1 ADENOSINE A1 low Adenosine A1 receptor | Adenosine Receptor A1
Type:
Enzyme Catalytic Domain
Mol. Mass.:
36501.39
Organism:
GUINEA PIG
Description:
ADENOSINE A1 ADORA1 GUINEA PIG::P47745
Residue:
326
  
Inhibitor
Name:
BDBM50224771
Synonyms:
2-chloro-N6-(R)-3-tetrahydrofuranyl-9H-(2-C-methyl-5-N-cyclopentylthiocarbamoyl-beta-D-ribofuranosyl)adenine | CHEMBL251799
Type:
Small organic molecule
Emp. Form.:
C21H29ClN6O5S
Mol. Mass.:
513.01
SMILES:
C[C@@]1(O)[C@H](O)[C@@H](COC(=S)NC2CCCC2)O[C@H]1n1cnc2c(N[C@@H]3CCOC3)nc(Cl)nc12
: