Target
Adenosine receptor A1
Ligand
BDBM50085658
Substrate
Meas. Tech.
ChEMBL_461281 (CHEMBL927305)
Ki
0.34±n/a nM
Citation
 Cappellacci, LFranchetti, PVita, PPetrelli, RLavecchia, ACosta, BSpinetti, FMartini, CKlotz, KNGrifantini, M 5'-Carbamoyl derivatives of 2'-C-methyl-purine nucleosides as selective A1 adenosine receptor agonists: affinity, efficacy, and selectivity for A1 receptor from different species. Bioorg Med Chem 16:336-53 (2008)  
Target
Name:
Adenosine receptor A1
Synonyms:
AA1R_BOVIN ADENOSINE A1 high ADORA1 | Adenosine A1 receptor
Type:
Enzyme Catalytic Domain
Mol. Mass.:
36602.99
Organism:
BOVINE
Description:
ADENOSINE 0 BOVINE::P28190
Residue:
326
  
Inhibitor
Name:
BDBM50085658
Synonyms:
(2R,3R,4S,5R)-2-(2-Chloro-6-cyclopentylamino-purin-9-yl)-5-hydroxymethyl-tetrahydro-furan-3,4-diol 2-(2-Chloro-6-cyclopentylamino-purin-9-yl)-5-hydroxymethyl-tetrahydro-furan-3,4-diol 2-Cl-CPA 5-(2-Chloro-6-cyclopentylamino-purin-9-yl)-tetrahydro-furan-2,3,4-triol CHEMBL284969 | N6-Cyclopentyl-2-chloroAdo
Type:
Small organic molecule
Emp. Form.:
C15H20ClN5O4
Mol. Mass.:
369.803
SMILES:
OC[C@H]1O[C@H]([C@H](O)[C@@H]1O)n1cnc2c(NC3CCCC3)nc(Cl)nc12
: