Target
Neuraminidase
Ligand
BDBM50233723
Substrate
Meas. Tech.
ChEMBL_462436 (CHEMBL927252)
Ki
1.2±n/a nM
Citation
 Krueger, ACXu, YKati, WMKempf, DJMaring, CJMcDaniel, KFMolla, AMontgomery, DKohlbrenner, WE Synthesis of potent pyrrolidine influenza neuraminidase inhibitors. Bioorg Med Chem Lett 18:1692-5 (2008)  
Target
Name:
Neuraminidase
Synonyms:
Influenza B Virus Neuraminidase NRAM_INBLE Neuraminidase B
Type:
Enzyme
Mol. Mass.:
51446.67
Organism:
Influenza B virus (B/Lee/40)
Description:
Residue:
466
  
Inhibitor
Name:
BDBM50233723
Synonyms:
(2R,4S,5R)-5-((1R,2R)-1-acetamido-2-hydroxy-2-methylpentyl)-4-(prop-1-enyl)pyrrolidine-2-carboxylic acid | CHEMBL251787
Type:
Small organic molecule
Emp. Form.:
C16H28N2O4
Mol. Mass.:
312.4045
SMILES:
CCC[C@@](C)(O)[C@H](NC(C)=O)[C@@H]1N[C@H](C[C@H]1\C=C/C)C(O)=O
: