Target
Neuraminidase
Ligand
BDBM50233728
Substrate
Meas. Tech.
ChEMBL_462436 (CHEMBL927252)
Ki
0.6±n/a nM
Citation
 Krueger, ACXu, YKati, WMKempf, DJMaring, CJMcDaniel, KFMolla, AMontgomery, DKohlbrenner, WE Synthesis of potent pyrrolidine influenza neuraminidase inhibitors. Bioorg Med Chem Lett 18:1692-5 (2008)  
Target
Name:
Neuraminidase
Synonyms:
Influenza B Virus Neuraminidase NRAM_INBLE Neuraminidase B
Type:
Enzyme
Mol. Mass.:
51446.67
Organism:
Influenza B virus (B/Lee/40)
Description:
Residue:
466
  
Inhibitor
Name:
BDBM50233728
Synonyms:
(2R,4S,5R)-5-((1R,2S)-1-acetamido-2-methoxybut-3-enyl)-4-(prop-1-enyl)pyrrolidine-2-carboxylic acid | CHEMBL254679
Type:
Small organic molecule
Emp. Form.:
C15H24N2O4
Mol. Mass.:
296.3621
SMILES:
CO[C@@H](C=C)[C@H](NC(C)=O)[C@@H]1N[C@H](C[C@H]1\C=C/C)C(O)=O
: