Target
Sodium channel protein type 9 subunit alpha
Ligand
BDBM50233758
Substrate
Meas. Tech.
ChEMBL_462438 (CHEMBL927254)
IC50
1000±n/a nM
Citation
 London, CHoyt, SBParsons, WHWilliams, BSWarren, VATschirret-Guth, RSmith, MMPriest, BTMcGowan, EMartin, WJLyons, KALi, XKaranam, BVJochnowitz, NGarcia, MLFelix, JPDean, BAbbadie, CKaczorowski, GJDuffy, JL Imidazopyridines: a novel class of hNav1.7 channel blockers. Bioorg Med Chem Lett 18:1696-701 (2008)  
Target
Name:
Sodium channel protein type 9 subunit alpha
Synonyms:
NENA Peripheral sodium channel 1 SCN9A_HUMAN Voltage-gated sodium channel subunit Nav1.7 hNE-Na
Type:
Protein
Mol. Mass.:
226375.97
Organism:
Homo sapiens (Human)
Description:
Q15858
Residue:
1988
  
Inhibitor
Name:
BDBM50233758
Synonyms:
CHEMBL253883 | tert-butyl (R)-1-((3-(1-cyclopropylethyl)-3H-imidazo[4,5-b]pyridin-2-yl)methylamino)-1-oxo-3-(2-(trifluoromethyl)phenyl)propan-2-ylcarbamate
Type:
Small organic molecule
Emp. Form.:
C27H32F3N5O3
Mol. Mass.:
531.5699
SMILES:
CC(C1CC1)n1c(CNC(=O)[C@@H](Cc2ccccc2C(F)(F)F)NC(=O)OC(C)(C)C)nc2cccnc12
: