Target
Growth hormone secretagogue receptor type 1
Ligand
BDBM50235852
Substrate
Meas. Tech.
ChEMBL_462860 (CHEMBL928778)
EC50
1.18±n/a nM
Citation
 Li, JChen, SYTao, SWang, HLi, JJSwartz, SMusial, CHernandez, AAFlynn, NMurphy, BJBeehler, BDickinson, KEGiupponi, LGrover, GSeethala, RSleph, PSlusarchyk, DYan, MHumphreys, WGZhang, HEwing, WRRobl, JAGordon, DTino, JA Design and synthesis of tetrazole-based growth hormone secretagogue: the SAR studies of the O-benzyl serine side chain. Bioorg Med Chem Lett 18:1825-9 (2008)  
Target
Name:
Growth hormone secretagogue receptor type 1
Synonyms:
GH-releasing peptide receptor GHS-R GHSR_HUMAN Ghrelin receptor | Ghrelin receptor 1a (GHS-R1a)
Type:
Receptor
Mol. Mass.:
41334.57
Organism:
Homo sapiens (Human)
Description:
Receptor binding studies use plasma membranes from LLC PK-1 cells transiently transfected with hGHSR1a.
Residue:
366
  
Inhibitor
Name:
BDBM50235852
Synonyms:
2-(5-((S)-2-(2-(pyridin-3-yl)benzyloxy)-1-(2-amino-2-methylpropanamido)ethyl)-1H-tetrazol-1-yl)ethyl 4-hydroxybutylcarbamate | CHEMBL404355
Type:
Small organic molecule
Emp. Form.:
C26H36N8O5
Mol. Mass.:
540.6146
SMILES:
CC(C)(N)C(=O)N[C@H](COCc1ccccc1-c1cccnc1)c1nnnn1CCOC(=O)NCCCCO
: