Target
UDP-N-acetylmuramoyl-tripeptide--D-alanyl-D-alanine ligase
Ligand
BDBM50137757
Substrate
Meas. Tech.
ChEMBL_463169 (CHEMBL946185)
IC50
9000±n/a nM
Citation
 Taha, MOAtallah, NAl-Bakri, AGParadis-Bleau, CZalloum, HYounis, KSLevesque, RC Discovery of new MurF inhibitors via pharmacophore modeling and QSAR analysis followed by in-silico screening. Bioorg Med Chem 16:1218-35 (2008)  
Target
Name:
UDP-N-acetylmuramoyl-tripeptide--D-alanyl-D-alanine ligase
Synonyms:
MurF (S. pneumoniae) UDP-N-acetylmuramoylalanine-D-glutamyl-lysine-D-alanyl-D-alanine ligase
Type:
Protein
Mol. Mass.:
50482.72
Organism:
Streptococcus pneumoniae (Firmicutes)
Description:
S. pneumoniae MurF
Residue:
457
  
Inhibitor
Name:
BDBM50137757
Synonyms:
2-Chloro-N-(3-cyano-5,6-dihydro-4H-cyclopenta[b]thiophen-2-yl)-5-(morpholine-4-sulfonyl)-benzamide CHEMBL316314
Type:
Small organic molecule
Emp. Form.:
C19H18ClN3O4S2
Mol. Mass.:
451.947
SMILES:
Clc1ccc(cc1C(=O)Nc1sc2CCCc2c1C#N)S(=O)(=O)N1CCOCC1
: