Target
UDP-N-acetylmuramoyl-tripeptide--D-alanyl-D-alanine ligase
Ligand
BDBM50371263
Substrate
Meas. Tech.
ChEMBL_463169 (CHEMBL946185)
IC50
6000±n/a nM
Citation
 Taha, MOAtallah, NAl-Bakri, AGParadis-Bleau, CZalloum, HYounis, KSLevesque, RC Discovery of new MurF inhibitors via pharmacophore modeling and QSAR analysis followed by in-silico screening. Bioorg Med Chem 16:1218-35 (2008)  
Target
Name:
UDP-N-acetylmuramoyl-tripeptide--D-alanyl-D-alanine ligase
Synonyms:
MurF (S. pneumoniae) UDP-N-acetylmuramoylalanine-D-glutamyl-lysine-D-alanyl-D-alanine ligase
Type:
Protein
Mol. Mass.:
50482.72
Organism:
Streptococcus pneumoniae (Firmicutes)
Description:
S. pneumoniae MurF
Residue:
457
  
Inhibitor
Name:
BDBM50371263
Synonyms:
CHEMBL409244
Type:
Small organic molecule
Emp. Form.:
C23H21ClN4O4S2
Mol. Mass.:
517.02
SMILES:
Clc1ccc(cc1C(=O)Nc1sc(CCc2ccncc2)cc1C#N)S(=O)(=O)N1CCOCC1
: