Target
UDP-N-acetylmuramoyl-tripeptide--D-alanyl-D-alanine ligase
Ligand
BDBM50137766
Substrate
Meas. Tech.
ChEMBL_463169 (CHEMBL946185)
IC50
15000±n/a nM
Citation
 Taha, MOAtallah, NAl-Bakri, AGParadis-Bleau, CZalloum, HYounis, KSLevesque, RC Discovery of new MurF inhibitors via pharmacophore modeling and QSAR analysis followed by in-silico screening. Bioorg Med Chem 16:1218-35 (2008)  
Target
Name:
UDP-N-acetylmuramoyl-tripeptide--D-alanyl-D-alanine ligase
Synonyms:
MurF (S. pneumoniae) UDP-N-acetylmuramoylalanine-D-glutamyl-lysine-D-alanyl-D-alanine ligase
Type:
Protein
Mol. Mass.:
50482.72
Organism:
Streptococcus pneumoniae (Firmicutes)
Description:
S. pneumoniae MurF
Residue:
457
  
Inhibitor
Name:
BDBM50137766
Synonyms:
2-chloro-N-(3-cyano-5,6-dihydro-4H-cyclopenta[b]thiophen-2-yl)-5-methylsulfamoyl-benzamide MurF inhibitor, 7
Type:
Small organic molecule
Emp. Form.:
C16H14ClN3O3S2
Mol. Mass.:
395.884
SMILES:
CNS(=O)(=O)c1ccc(Cl)c(c1)C(=O)Nc1sc2CCCc2c1C#N
: