Target
Cytochrome P450 3A4
Ligand
BDBM50371332
Substrate
Meas. Tech.
ChEMBL_463230 (CHEMBL930619)
IC50
>10000±n/a nM
Citation
 Wood, MRSchirripa, KMKim, JJKuduk, SDChang, RKDi Marco, CNDiPardo, RMWan, BLMurphy, KLRansom, RWChang, RSHolahan, MACook, JJLemaire, WMosser, SDBednar, RATang, CPrueksaritanont, TWallace, AAMei, QYu, JBohn, DLClayton, FCAdarayn, EDSitko, GRLeonard, YMFreidinger, RMPettibone, DJBock, MG Alpha-hydroxy amides as a novel class of bradykinin B1 selective antagonists. Bioorg Med Chem Lett 18:716-20 (2008)  
Target
Name:
Cytochrome P450 3A4
Synonyms:
Albendazole monooxygenase CP3A4_HUMAN CYP3A4 CYPIIIA4 Cytochrome P450 3A4 (CYP3A4) Nifedipine oxidase Taurochenodeoxycholate 6-alpha-hydroxylase
Type:
Enzyme
Mol. Mass.:
57349.57
Organism:
Homo sapiens (Human)
Description:
Residue:
503
  
Inhibitor
Name:
BDBM50371332
Synonyms:
CHEMBL258324
Type:
Small organic molecule
Emp. Form.:
C19H16ClF5N6O2
Mol. Mass.:
490.814
SMILES:
C[C@@H](NC(=O)[C@@](C)(O)C(F)(F)F)c1ncc(cc1F)-c1cc(Cl)cc(F)c1-c1nnn(C)n1
: