Target
Intermediate conductance calcium-activated potassium channel protein 4
Ligand
BDBM50371384
Substrate
Meas. Tech.
ChEMBL_463302 (CHEMBL948111)
IC50
15±n/a nM
Citation
 McNaughton-Smith, GABurns, JFStocker, JWRigdon, GCCreech, CArrington, SShelton, Tde Franceschi, L Novel inhibitors of the Gardos channel for the treatment of sickle cell disease. J Med Chem 51:976-82 (2008)  
Target
Name:
Intermediate conductance calcium-activated potassium channel protein 4
Synonyms:
IK1 KCA4 KCNN4_HUMAN SK4
Type:
PROTEIN
Mol. Mass.:
47723.22
Organism:
Homo sapiens (Human)
Description:
ChEMBL_1361891
Residue:
427
  
Inhibitor
Name:
BDBM50371384
Synonyms:
CHEMBL270071
Type:
Small organic molecule
Emp. Form.:
C20H16FNO
Mol. Mass.:
305.3455
SMILES:
NC(=O)C(c1ccccc1)(c1ccccc1)c1ccccc1F
: