Target
5-hydroxytryptamine receptor 1D
Ligand
BDBM50371445
Substrate
Meas. Tech.
ChEMBL_463651 (CHEMBL930819)
Ki
446±n/a nM
Citation
 Peters, JULübbers, TAlanine, AKolczewski, SBlasco, FSteward, L Cyclic guanidines as dual 5-HT5A/5-HT7 receptor ligands: structure-activity relationship elucidation. Bioorg Med Chem Lett 18:256-61 (2008)  
Target
Name:
5-hydroxytryptamine receptor 1D
Synonyms:
5-HT-1D 5-HT1D 5HT1D_HUMAN HTR1DA Serotonin (5-HT) receptor | Serotonin Receptor 1D
Type:
G Protein-Coupled Receptor (GPCR)
Mol. Mass.:
41920.63
Organism:
Homo sapiens (Human)
Description:
Receptor binding assays were performed using human clone stably expressed in CHO cells.
Residue:
377
  
Inhibitor
Name:
BDBM50371445
Synonyms:
CHEMBL408152
Type:
Small organic molecule
Emp. Form.:
C10H13N3O
Mol. Mass.:
191.2297
SMILES:
COc1cccc2C(C)NC(N)=Nc12
: