Target
5-hydroxytryptamine receptor 7
Ligand
BDBM50371461
Substrate
Meas. Tech.
ChEMBL_463656 (CHEMBL930824)
Ki
2.4±n/a nM
Citation
 Peters, JULübbers, TAlanine, AKolczewski, SBlasco, FSteward, L Cyclic guanidines as dual 5-HT5A/5-HT7 receptor ligands: structure-activity relationship elucidation. Bioorg Med Chem Lett 18:256-61 (2008)  
Target
Name:
5-hydroxytryptamine receptor 7
Synonyms:
5-HT-7 5-HT7 5-HT7S 5HT7 HTR7 | Serotonin receptor 7
Type:
G Protein-Coupled Receptor (GPCR)
Mol. Mass.:
53573.08
Organism:
Homo sapiens (Human)
Description:
P34969
Residue:
479
  
Inhibitor
Name:
BDBM50371461
Synonyms:
CHEMBL402179
Type:
Small organic molecule
Emp. Form.:
C13H19N3O
Mol. Mass.:
233.3095
SMILES:
CNC1=Nc2c(OC(C)C)cccc2C(C)N1
: