Target
C-X-C chemokine receptor type 3
Ligand
BDBM50371508
Substrate
Meas. Tech.
ChEMBL_463732 (CHEMBL932090)
IC50
2.5±n/a nM
Citation
 Du, XChen, XMihalic, JTDeignan, JDuquette, JLi, ARLemon, BMa, JMiao, SEbsworth, KSullivan, TJTonn, GCollins, TLMedina, JC Design and optimization of imidazole derivatives as potent CXCR3 antagonists. Bioorg Med Chem Lett 18:608-13 (2008)  
Target
Name:
C-X-C chemokine receptor type 3
Synonyms:
AAO92295.1 C-X-C chemokine receptor type 3 (CXCR3) CXCR3 CXCR3_HUMAN chemokine (C-X-C motif) receptor 3
Type:
Enzyme Catalytic Domain
Mol. Mass.:
40665.65
Organism:
Homo sapiens (Human)
Description:
Residue:
368
  
Inhibitor
Name:
BDBM50371508
Synonyms:
CHEMBL271423
Type:
Small organic molecule
Emp. Form.:
C29H32F4N4O3S
Mol. Mass.:
592.648
SMILES:
CCS(=O)(=O)CCN([C@H](C)c1nc(cn1-c1ccc(cc1)C#N)C(C)(C)C)C(=O)Cc1ccc(F)c(c1)C(F)(F)F
: