Target
NPC1-like intracellular cholesterol transporter 1
Ligand
BDBM50371517
Substrate
Meas. Tech.
ChEMBL_463744 (CHEMBL932102)
Ki
11000±n/a nM
Citation
 Pfefferkorn, JALarsen, SDVan Huis, CSorenson, RBarton, TWinters, TAuerbach, BWu, CWolfram, TJCai, HWelch, KEsmaiel, NDavis, JBousley, ROlsen, KMueller, SBMertz, T Substituted oxazolidinones as novel NPC1L1 ligands for the inhibition of cholesterol absorption. Bioorg Med Chem Lett 18:546-53 (2008)  
Target
Name:
NPC1-like intracellular cholesterol transporter 1
Synonyms:
NPCL1_RAT Npc1l1
Type:
PROTEIN
Mol. Mass.:
146415.18
Organism:
Rattus norvegicus
Description:
ChEMBL_463744
Residue:
1331
  
Inhibitor
Name:
BDBM50371517
Synonyms:
CHEMBL256248
Type:
Small organic molecule
Emp. Form.:
C25H23FN2O5
Mol. Mass.:
450.4589
SMILES:
COc1cccc(CN(C)C(=O)[C@H]2OC(=O)N([C@@H]2c2ccc(O)cc2)c2ccc(F)cc2)c1
: