Target
NPC1-like intracellular cholesterol transporter 1
Ligand
BDBM50371535
Substrate
Meas. Tech.
ChEMBL_463744 (CHEMBL932102)
Ki
18000±n/a nM
Citation
 Pfefferkorn, JALarsen, SDVan Huis, CSorenson, RBarton, TWinters, TAuerbach, BWu, CWolfram, TJCai, HWelch, KEsmaiel, NDavis, JBousley, ROlsen, KMueller, SBMertz, T Substituted oxazolidinones as novel NPC1L1 ligands for the inhibition of cholesterol absorption. Bioorg Med Chem Lett 18:546-53 (2008)  
Target
Name:
NPC1-like intracellular cholesterol transporter 1
Synonyms:
NPCL1_RAT Npc1l1
Type:
PROTEIN
Mol. Mass.:
146415.18
Organism:
Rattus norvegicus
Description:
ChEMBL_463744
Residue:
1331
  
Inhibitor
Name:
BDBM50371535
Synonyms:
CHEMBL257095
Type:
Small organic molecule
Emp. Form.:
C24H21F2NO4
Mol. Mass.:
425.4246
SMILES:
O[C@H](CCc1ccccc1)[C@H]1OC(=O)N([C@@H]1c1cc(F)ccc1O)c1cccc(F)c1
: